{"text_format":"1","workbook":"xlsx","n_sheets":7,"sheets":["Introduction","Wines","Beers","Liquors","Hidden Fields","Summary","About"],"not_rendered":{"charts":0,"images":0,"macros":1,"external_links":0,"defined_names":0,"comments":0,"pivot_tables":4},"unopened":[],"bounds":{"document_bytes":16777216,"sheet_cells":100000,"rows_first":2000,"rows_last":500,"rows_between":2000,"halvings":0,"cell_chars":16384,"cell_head_chars":4096},"cells_cut":0,"cells_raw":0,"read":"whole","date_system":"1900"}

{"sheet":"Introduction","index":0,"n_rows":25,"n_cols":4,"rows_kept":25,"cut":false,"hidden":false,"merged":[[1,3,16,10]]}
[]
["Distributor Name","Wine Glass Pours\nper Bottle",null,"Utilize this spreadsheet to easily calculate your pour cost, margin and markup for each item and categories of products. There is a separate worksheet (tab) in this file for wines, beers and spirits. Fill in basic information about your products, including the unit cost and the price you charge. Pour cost, margin and markups will be calculated automatically in each row. There is also a worksheet to view the summary and categorized data.\n\nInstructions:\n1. Start on this page by listing all of your distributors under Distributor Name if you want to be able to remember and sort products by distributor.\n2. Underneath \"Wine Glass Pours per Bottle\" enter in how many glasses of wine you get from each bottle when serving to customers.\n3. On each of the worksheets, enter data into the white cells.\n    a) Some of the fields will require you to select from a drop-down list\n    b) For beer and liquor, you will need to enter in your standard serving size in ounces so that the correct calculations can be made\n\n© 2017 Uncorkd Inc. - http://www.uncorkd.biz - click this box for more information about Uncorkd"]
["Distributor A",5]
["Distributor B"]
["Distributor C"]
["Distributor D"]
[]
[]
[]
[]
[]
[]
[]
[]
[]
{"$rows_left_out":11}
{"sheet":"Wines","index":1,"n_rows":414,"n_cols":12,"rows_kept":414,"cut":false,"hidden":false,"merged":[]}
["Wine Name","Size","Cost","Distributor","Type","Menu Price\n-Glass-","Menu Price\n-Bottle-","$ cost/oz","% Margin\n-Glass-","Markup\n-Glass-","% Margin\n-Bottle-","Markup\n-Bottle-"]
["Sample Wine 1","750ml",20.55,"Distributor A","Sparkling",13,49,{"$f":"IFERROR(C2/VLOOKUP(B2,'Hidden Fields'!$A$2:$B$10,2,FALSE),\"\")","v":0.81225296442687744},{"$f":"IFERROR((F2-(C2/Introduction!$B$3))/F2,\"\")","v":0.68384615384615388},{"$f":"IFERROR(F2/(C2/Introduction!$B$3),\"\")","v":3.16301703163017},{"$f":"IFERROR((G2-C2)/G2,\"\")","v":0.58061224489795915},{"$f":"IFERROR(G2/C2,\"\")","v":2.384428223844282}]
["Sample Wine 2","750ml",42.6,"Distributor D","White",18,72,{"$f":"IFERROR(C3/VLOOKUP(B3,'Hidden Fields'!$A$2:$B$10,2,FALSE),\"\")","v":1.6837944664031621},{"$f":"IFERROR((F3-(C3/Introduction!$B$3))/F3,\"\")","v":0.52666666666666673},{"$f":"IFERROR(F3/(C3/Introduction!$B$3),\"\")","v":2.1126760563380285},{"$f":"IFERROR((G3-C3)/G3,\"\")","v":0.40833333333333333},{"$f":"IFERROR(G3/C3,\"\")","v":1.6901408450704225}]
["Sample Wine 3","750ml",120.5,"Distributor D","Red",null,210,{"$f":"IFERROR(C4/VLOOKUP(B4,'Hidden Fields'!$A$2:$B$10,2,FALSE),\"\")","v":4.7628458498023711},{"$f":"IFERROR((F4-(C4/Introduction!$B$3))/F4,\"\")","v":""},{"$f":"IFERROR(F4/(C4/Introduction!$B$3),\"\")","v":0},0.42619047619047618,1.7427385892116183]
["Sample Wine 4","750ml",11.1,"Distributor A","Rose",10,42,{"$f":"IFERROR(C5/VLOOKUP(B5,'Hidden Fields'!$A$2:$B$10,2,FALSE),\"\")","v":0.43873517786561261},{"$f":"IFERROR((F5-(C5/Introduction!$B$3))/F5,\"\")","v":0.77800000000000002},{"$f":"IFERROR(F5/(C5/Introduction!$B$3),\"\")","v":4.5045045045045047},0.73571428571428565,3.7837837837837838]
["Sample Wine 5","750ml",12.1,"Distributor B","Sparkling",9,35,{"$f":"IFERROR(C6/VLOOKUP(B6,'Hidden Fields'!$A$2:$B$10,2,FALSE),\"\")","v":0.47826086956521735},{"$f":"IFERROR((F6-(C6/Introduction!$B$3))/F6,\"\")","v":0.73111111111111116},{"$f":"IFERROR(F6/(C6/Introduction!$B$3),\"\")","v":3.71900826446281},0.65428571428571425,2.8925619834710745]
[null,null,null,null,null,null,null,{"$f":"IFERROR(C7/VLOOKUP(B7,'Hidden Fields'!$A$2:$B$10,2,FALSE),\"\")","v":""},{"$f":"IFERROR((F7-(C7/Introduction!$B$3))/F7,\"\")","v":""},{"$f":"IFERROR(F7/(C7/Introduction!$B$3),\"\")","v":""},"",""]
[null,null,null,null,null,null,null,{"$f":"IFERROR(C8/VLOOKUP(B8,'Hidden Fields'!$A$2:$B$10,2,FALSE),\"\")","v":""},{"$f":"IFERROR((F8-(C8/Introduction!$B$3))/F8,\"\")","v":""},{"$f":"IFERROR(F8/(C8/Introduction!$B$3),\"\")","v":""},"",""]
[null,null,null,null,null,null,null,{"$f":"IFERROR(C9/VLOOKUP(B9,'Hidden Fields'!$A$2:$B$10,2,FALSE),\"\")","v":""},{"$f":"IFERROR((F9-(C9/Introduction!$B$3))/F9,\"\")","v":""},{"$f":"IFERROR(F9/(C9/Introduction!$B$3),\"\")","v":""},"",""]
[null,null,null,null,null,null,null,{"$f":"IFERROR(C10/VLOOKUP(B10,'Hidden Fields'!$A$2:$B$10,2,FALSE),\"\")","v":""},{"$f":"IFERROR((F10-(C10/Introduction!$B$3))/F10,\"\")","v":""},{"$f":"IFERROR(F10/(C10/Introduction!$B$3),\"\")","v":""},"",""]
[null,null,null,null,null,null,null,{"$f":"IFERROR(C11/VLOOKUP(B11,'Hidden Fields'!$A$2:$B$10,2,FALSE),\"\")","v":""},{"$f":"IFERROR((F11-(C11/Introduction!$B$3))/F11,\"\")","v":""},{"$f":"IFERROR(F11/(C11/Introduction!$B$3),\"\")","v":""},"",""]
[null,null,null,null,null,null,null,{"$f":"IFERROR(C12/VLOOKUP(B12,'Hidden Fields'!$A$2:$B$10,2,FALSE),\"\")","v":""},{"$f":"IFERROR((F12-(C12/Introduction!$B$3))/F12,\"\")","v":""},{"$f":"IFERROR(F12/(C12/Introduction!$B$3),\"\")","v":""},"",""]
[null,null,null,null,null,null,null,{"$f":"IFERROR(C13/VLOOKUP(B13,'Hidden Fields'!$A$2:$B$10,2,FALSE),\"\")","v":""},{"$f":"IFERROR((F13-(C13/Introduction!$B$3))/F13,\"\")","v":""},{"$f":"IFERROR(F13/(C13/Introduction!$B$3),\"\")","v":""},"",""]
[null,null,null,null,null,null,null,{"$f":"IFERROR(C14/VLOOKUP(B14,'Hidden Fields'!$A$2:$B$10,2,FALSE),\"\")","v":""},{"$f":"IFERROR((F14-(C14/Introduction!$B$3))/F14,\"\")","v":""},{"$f":"IFERROR(F14/(C14/Introduction!$B$3),\"\")","v":""},"",""]
[null,null,null,null,null,null,null,{"$f":"IFERROR(C15/VLOOKUP(B15,'Hidden Fields'!$A$2:$B$10,2,FALSE),\"\")","v":""},{"$f":"IFERROR((F15-(C15/Introduction!$B$3))/F15,\"\")","v":""},{"$f":"IFERROR(F15/(C15/Introduction!$B$3),\"\")","v":""},"",""]
{"$rows_left_out":400}
{"sheet":"Beers","index":2,"n_rows":414,"n_cols":11,"rows_kept":414,"cut":false,"hidden":false,"merged":[]}
["Beer Name","Size","Cost","Distributor","Category","Type","Menu Price","Pour Size (oz) Draft","$ cost/oz","% Margin","Markup"]
["Sample Beer 1","12oz",0.75,"Distributor B","Bottle","Lager",6,null,{"$f":"IFERROR(C2/VLOOKUP(B2,'Hidden Fields'!$C$2:$D$10,2,FALSE),\"\")","v":6.25E-2},{"$f":"IF(E2<>\"Draft\",IFERROR((G2-C2)/G2,\"\"),IFERROR((G2-((C2*H2)/VLOOKUP(B2,'Hidden Fields'!$C$2:$D$10,2,FALSE)))/G2,\"\"))","v":0.875},{"$f":"IF(E2<>\"Draft\",IFERROR(G2/C2,\"\"),IFERROR((G2/((C2*H2)/VLOOKUP(B2,'Hidden Fields'!$C$2:$D$10,2,FALSE))),\"\"))","v":8}]
["Sample Beer 2","1/2 barrel keg (15.5g)",189,"Distributor C","Draft","India Pale Ale",7,16,{"$f":"IFERROR(C3/VLOOKUP(B3,'Hidden Fields'!$C$2:$D$10,2,FALSE),\"\")","v":9.5454545454545459E-2},{"$f":"IF(E3<>\"Draft\",IFERROR((G3-C3)/G3,\"\"),IFERROR((G3-((C3*H3)/VLOOKUP(B3,'Hidden Fields'!$C$2:$D$10,2,FALSE)))/G3,\"\"))","v":0.78181818181818186},{"$f":"IF(E3<>\"Draft\",IFERROR(G3/C3,\"\"),IFERROR((G3/((C3*H3)/VLOOKUP(B3,'Hidden Fields'!$C$2:$D$10,2,FALSE))),\"\"))","v":4.583333333333333}]
["Sample Beer 3","1/4 barrel keg (7.75g)",156,"Distributor C","Draft","Brown Ale",7,16,{"$f":"IFERROR(C4/VLOOKUP(B4,'Hidden Fields'!$C$2:$D$10,2,FALSE),\"\")","v":0.15853658536585366},{"$f":"IF(E4<>\"Draft\",IFERROR((G4-C4)/G4,\"\"),IFERROR((G4-((C4*H4)/VLOOKUP(B4,'Hidden Fields'!$C$2:$D$10,2,FALSE)))/G4,\"\"))","v":0.6376306620209059},{"$f":"IF(E4<>\"Draft\",IFERROR(G4/C4,\"\"),IFERROR((G4/((C4*H4)/VLOOKUP(B4,'Hidden Fields'!$C$2:$D$10,2,FALSE))),\"\"))","v":2.7596153846153846}]
["Sample Beer 4","Cornelius keg (5g)",120,"Distributor C","Draft","Belgian",7,16,{"$f":"IFERROR(C5/VLOOKUP(B5,'Hidden Fields'!$C$2:$D$10,2,FALSE),\"\")","v":0.1875},{"$f":"IF(E5<>\"Draft\",IFERROR((G5-C5)/G5,\"\"),IFERROR((G5-((C5*H5)/VLOOKUP(B5,'Hidden Fields'!$C$2:$D$10,2,FALSE)))/G5,\"\"))","v":0.5714285714285714},{"$f":"IF(E5<>\"Draft\",IFERROR(G5/C5,\"\"),IFERROR((G5/((C5*H5)/VLOOKUP(B5,'Hidden Fields'!$C$2:$D$10,2,FALSE))),\"\"))","v":2.3333333333333335}]
["Sample Beer 5","1/6 barrel keg (5.16g)",150,"Distributor B","Draft","Belgian",7,10,{"$f":"IFERROR(C6/VLOOKUP(B6,'Hidden Fields'!$C$2:$D$10,2,FALSE),\"\")","v":0.22727272727272727},{"$f":"IF(E6<>\"Draft\",IFERROR((G6-C6)/G6,\"\"),IFERROR((G6-((C6*H6)/VLOOKUP(B6,'Hidden Fields'!$C$2:$D$10,2,FALSE)))/G6,\"\"))","v":0.67532467532467522},{"$f":"IF(E6<>\"Draft\",IFERROR(G6/C6,\"\"),IFERROR((G6/((C6*H6)/VLOOKUP(B6,'Hidden Fields'!$C$2:$D$10,2,FALSE))),\"\"))","v":3.0799999999999996}]
[null,null,null,null,null,null,null,null,{"$f":"IFERROR(C7/VLOOKUP(B7,'Hidden Fields'!$C$2:$D$10,2,FALSE),\"\")","v":""},{"$f":"IF(E7<>\"Draft\",IFERROR((G7-C7)/G7,\"\"),IFERROR((G7-((C7*H7)/VLOOKUP(B7,'Hidden Fields'!$C$2:$D$10,2,FALSE)))/G7,\"\"))","v":""},{"$f":"IF(E7<>\"Draft\",IFERROR(G7/C7,\"\"),IFERROR((G7/((C7*H7)/VLOOKUP(B7,'Hidden Fields'!$C$2:$D$10,2,FALSE))),\"\"))","v":""}]
[null,null,null,null,null,null,null,null,{"$f":"IFERROR(C8/VLOOKUP(B8,'Hidden Fields'!$C$2:$D$10,2,FALSE),\"\")","v":""},{"$f":"IF(E8<>\"Draft\",IFERROR((G8-C8)/G8,\"\"),IFERROR((G8-((C8*H8)/VLOOKUP(B8,'Hidden Fields'!$C$2:$D$10,2,FALSE)))/G8,\"\"))","v":""},{"$f":"IF(E8<>\"Draft\",IFERROR(G8/C8,\"\"),IFERROR((G8/((C8*H8)/VLOOKUP(B8,'Hidden Fields'!$C$2:$D$10,2,FALSE))),\"\"))","v":""}]
[null,null,null,null,null,null,null,null,{"$f":"IFERROR(C9/VLOOKUP(B9,'Hidden Fields'!$C$2:$D$10,2,FALSE),\"\")","v":""},{"$f":"IF(E9<>\"Draft\",IFERROR((G9-C9)/G9,\"\"),IFERROR((G9-((C9*H9)/VLOOKUP(B9,'Hidden Fields'!$C$2:$D$10,2,FALSE)))/G9,\"\"))","v":""},{"$f":"IF(E9<>\"Draft\",IFERROR(G9/C9,\"\"),IFERROR((G9/((C9*H9)/VLOOKUP(B9,'Hidden Fields'!$C$2:$D$10,2,FALSE))),\"\"))","v":""}]
[null,null,null,null,null,null,null,null,{"$f":"IFERROR(C10/VLOOKUP(B10,'Hidden Fields'!$C$2:$D$10,2,FALSE),\"\")","v":""},{"$f":"IF(E10<>\"Draft\",IFERROR((G10-C10)/G10,\"\"),IFERROR((G10-((C10*H10)/VLOOKUP(B10,'Hidden Fields'!$C$2:$D$10,2,FALSE)))/G10,\"\"))","v":""},{"$f":"IF(E10<>\"Draft\",IFERROR(G10/C10,\"\"),IFERROR((G10/((C10*H10)/VLOOKUP(B10,'Hidden Fields'!$C$2:$D$10,2,FALSE))),\"\"))","v":""}]
[null,null,null,null,null,null,null,null,{"$f":"IFERROR(C11/VLOOKUP(B11,'Hidden Fields'!$C$2:$D$10,2,FALSE),\"\")","v":""},{"$f":"IF(E11<>\"Draft\",IFERROR((G11-C11)/G11,\"\"),IFERROR((G11-((C11*H11)/VLOOKUP(B11,'Hidden Fields'!$C$2:$D$10,2,FALSE)))/G11,\"\"))","v":""},{"$f":"IF(E11<>\"Draft\",IFERROR(G11/C11,\"\"),IFERROR((G11/((C11*H11)/VLOOKUP(B11,'Hidden Fields'!$C$2:$D$10,2,FALSE))),\"\"))","v":""}]
[null,null,null,null,null,null,null,null,{"$f":"IFERROR(C12/VLOOKUP(B12,'Hidden Fields'!$C$2:$D$10,2,FALSE),\"\")","v":""},{"$f":"IF(E12<>\"Draft\",IFERROR((G12-C12)/G12,\"\"),IFERROR((G12-((C12*H12)/VLOOKUP(B12,'Hidden Fields'!$C$2:$D$10,2,FALSE)))/G12,\"\"))","v":""},{"$f":"IF(E12<>\"Draft\",IFERROR(G12/C12,\"\"),IFERROR((G12/((C12*H12)/VLOOKUP(B12,'Hidden Fields'!$C$2:$D$10,2,FALSE))),\"\"))","v":""}]
[null,null,null,null,null,null,null,null,{"$f":"IFERROR(C13/VLOOKUP(B13,'Hidden Fields'!$C$2:$D$10,2,FALSE),\"\")","v":""},{"$f":"IF(E13<>\"Draft\",IFERROR((G13-C13)/G13,\"\"),IFERROR((G13-((C13*H13)/VLOOKUP(B13,'Hidden Fields'!$C$2:$D$10,2,FALSE)))/G13,\"\"))","v":""},{"$f":"IF(E13<>\"Draft\",IFERROR(G13/C13,\"\"),IFERROR((G13/((C13*H13)/VLOOKUP(B13,'Hidden Fields'!$C$2:$D$10,2,FALSE))),\"\"))","v":""}]
[null,null,null,null,null,null,null,null,{"$f":"IFERROR(C14/VLOOKUP(B14,'Hidden Fields'!$C$2:$D$10,2,FALSE),\"\")","v":""},{"$f":"IF(E14<>\"Draft\",IFERROR((G14-C14)/G14,\"\"),IFERROR((G14-((C14*H14)/VLOOKUP(B14,'Hidden Fields'!$C$2:$D$10,2,FALSE)))/G14,\"\"))","v":""},{"$f":"IF(E14<>\"Draft\",IFERROR(G14/C14,\"\"),IFERROR((G14/((C14*H14)/VLOOKUP(B14,'Hidden Fields'!$C$2:$D$10,2,FALSE))),\"\"))","v":""}]
[null,null,null,null,null,null,null,null,{"$f":"IFERROR(C15/VLOOKUP(B15,'Hidden Fields'!$C$2:$D$10,2,FALSE),\"\")","v":""},{"$f":"IF(E15<>\"Draft\",IFERROR((G15-C15)/G15,\"\"),IFERROR((G15-((C15*H15)/VLOOKUP(B15,'Hidden Fields'!$C$2:$D$10,2,FALSE)))/G15,\"\"))","v":""},{"$f":"IF(E15<>\"Draft\",IFERROR(G15/C15,\"\"),IFERROR((G15/((C15*H15)/VLOOKUP(B15,'Hidden Fields'!$C$2:$D$10,2,FALSE))),\"\"))","v":""}]
{"$rows_left_out":400}
{"sheet":"Liquors","index":3,"n_rows":414,"n_cols":11,"rows_kept":414,"cut":false,"hidden":false,"merged":[]}
["Liquor Name","Size","Cost","Distributor","Category","Type","Menu Price","Pour Size (oz)","$ cost/oz","% Margin","Markup"]
["Sample Liquor 1","750ml",8.5,"Distributor A","Well","Rum",6,2,{"$f":"IFERROR(C2/VLOOKUP(B2,'Hidden Fields'!$E$2:$F$3,2,FALSE),\"\")","v":0.33596837944664032},{"$f":"IFERROR((G2-((C2*H2)/VLOOKUP(B2,'Hidden Fields'!$E$2:$F$3,2,FALSE)))/G2,\"\")","v":0.88801054018445325},{"$f":"IFERROR(G2/((C2*H2)/VLOOKUP(B2,'Hidden Fields'!$E$2:$F$3,2,FALSE)),\"\")","v":8.9294117647058826}]
["Sample Liquor 2","750ml",34.75,"Distributor D","Top Shelf","Vodka",10,2,{"$f":"IFERROR(C3/VLOOKUP(B3,'Hidden Fields'!$E$2:$F$3,2,FALSE),\"\")","v":1.3735177865612649},{"$f":"IFERROR((G3-((C3*H3)/VLOOKUP(B3,'Hidden Fields'!$E$2:$F$3,2,FALSE)))/G3,\"\")","v":0.72529644268774707},{"$f":"IFERROR(G3/((C3*H3)/VLOOKUP(B3,'Hidden Fields'!$E$2:$F$3,2,FALSE)),\"\")","v":3.6402877697841727}]
["Sample Liquor 3","750ml",23.9,"Distributor C","Premium","Bourbon",8,2,{"$f":"IFERROR(C4/VLOOKUP(B4,'Hidden Fields'!$E$2:$F$3,2,FALSE),\"\")","v":0.94466403162055324},{"$f":"IFERROR((G4-((C4*H4)/VLOOKUP(B4,'Hidden Fields'!$E$2:$F$3,2,FALSE)))/G4,\"\")","v":0.76383399209486169},{"$f":"IFERROR(G4/((C4*H4)/VLOOKUP(B4,'Hidden Fields'!$E$2:$F$3,2,FALSE)),\"\")","v":4.2343096234309625}]
["Sample Liquor 4","750ml",78.2,"Distributor A","Top Shelf","Whiskey",25,2,{"$f":"IFERROR(C5/VLOOKUP(B5,'Hidden Fields'!$E$2:$F$3,2,FALSE),\"\")","v":3.0909090909090908},{"$f":"IFERROR((G5-((C5*H5)/VLOOKUP(B5,'Hidden Fields'!$E$2:$F$3,2,FALSE)))/G5,\"\")","v":0.7527272727272728},{"$f":"IFERROR(G5/((C5*H5)/VLOOKUP(B5,'Hidden Fields'!$E$2:$F$3,2,FALSE)),\"\")","v":4.0441176470588234}]
["Sample Liquor 5","750ml",40.1,"Distributor A","Call","Brandy",12,2,{"$f":"IFERROR(C6/VLOOKUP(B6,'Hidden Fields'!$E$2:$F$3,2,FALSE),\"\")","v":1.5849802371541502},{"$f":"IFERROR((G6-((C6*H6)/VLOOKUP(B6,'Hidden Fields'!$E$2:$F$3,2,FALSE)))/G6,\"\")","v":0.73583662714097497},{"$f":"IFERROR(G6/((C6*H6)/VLOOKUP(B6,'Hidden Fields'!$E$2:$F$3,2,FALSE)),\"\")","v":3.7855361596009978}]
[null,null,null,null,null,null,null,null,{"$f":"IFERROR(C7/VLOOKUP(B7,'Hidden Fields'!$E$2:$F$3,2,FALSE),\"\")","v":""},{"$f":"IFERROR((G7-((C7*H7)/VLOOKUP(B7,'Hidden Fields'!$E$2:$F$3,2,FALSE)))/G7,\"\")","v":""},{"$f":"IFERROR(G7/((C7*H7)/VLOOKUP(B7,'Hidden Fields'!$E$2:$F$3,2,FALSE)),\"\")","v":""}]
[null,null,null,null,null,null,null,null,{"$f":"IFERROR(C8/VLOOKUP(B8,'Hidden Fields'!$E$2:$F$3,2,FALSE),\"\")","v":""},{"$f":"IFERROR((G8-((C8*H8)/VLOOKUP(B8,'Hidden Fields'!$E$2:$F$3,2,FALSE)))/G8,\"\")","v":""},{"$f":"IFERROR(G8/((C8*H8)/VLOOKUP(B8,'Hidden Fields'!$E$2:$F$3,2,FALSE)),\"\")","v":""}]
[null,null,null,null,null,null,null,null,{"$f":"IFERROR(C9/VLOOKUP(B9,'Hidden Fields'!$E$2:$F$3,2,FALSE),\"\")","v":""},{"$f":"IFERROR((G9-((C9*H9)/VLOOKUP(B9,'Hidden Fields'!$E$2:$F$3,2,FALSE)))/G9,\"\")","v":""},{"$f":"IFERROR(G9/((C9*H9)/VLOOKUP(B9,'Hidden Fields'!$E$2:$F$3,2,FALSE)),\"\")","v":""}]
[null,null,null,null,null,null,null,null,{"$f":"IFERROR(C10/VLOOKUP(B10,'Hidden Fields'!$E$2:$F$3,2,FALSE),\"\")","v":""},{"$f":"IFERROR((G10-((C10*H10)/VLOOKUP(B10,'Hidden Fields'!$E$2:$F$3,2,FALSE)))/G10,\"\")","v":""},{"$f":"IFERROR(G10/((C10*H10)/VLOOKUP(B10,'Hidden Fields'!$E$2:$F$3,2,FALSE)),\"\")","v":""}]
[null,null,null,null,null,null,null,null,{"$f":"IFERROR(C11/VLOOKUP(B11,'Hidden Fields'!$E$2:$F$3,2,FALSE),\"\")","v":""},{"$f":"IFERROR((G11-((C11*H11)/VLOOKUP(B11,'Hidden Fields'!$E$2:$F$3,2,FALSE)))/G11,\"\")","v":""},{"$f":"IFERROR(G11/((C11*H11)/VLOOKUP(B11,'Hidden Fields'!$E$2:$F$3,2,FALSE)),\"\")","v":""}]
[null,null,null,null,null,null,null,null,{"$f":"IFERROR(C12/VLOOKUP(B12,'Hidden Fields'!$E$2:$F$3,2,FALSE),\"\")","v":""},{"$f":"IFERROR((G12-((C12*H12)/VLOOKUP(B12,'Hidden Fields'!$E$2:$F$3,2,FALSE)))/G12,\"\")","v":""},{"$f":"IFERROR(G12/((C12*H12)/VLOOKUP(B12,'Hidden Fields'!$E$2:$F$3,2,FALSE)),\"\")","v":""}]
[null,null,null,null,null,null,null,null,{"$f":"IFERROR(C13/VLOOKUP(B13,'Hidden Fields'!$E$2:$F$3,2,FALSE),\"\")","v":""},{"$f":"IFERROR((G13-((C13*H13)/VLOOKUP(B13,'Hidden Fields'!$E$2:$F$3,2,FALSE)))/G13,\"\")","v":""},{"$f":"IFERROR(G13/((C13*H13)/VLOOKUP(B13,'Hidden Fields'!$E$2:$F$3,2,FALSE)),\"\")","v":""}]
[null,null,null,null,null,null,null,null,{"$f":"IFERROR(C14/VLOOKUP(B14,'Hidden Fields'!$E$2:$F$3,2,FALSE),\"\")","v":""},{"$f":"IFERROR((G14-((C14*H14)/VLOOKUP(B14,'Hidden Fields'!$E$2:$F$3,2,FALSE)))/G14,\"\")","v":""},{"$f":"IFERROR(G14/((C14*H14)/VLOOKUP(B14,'Hidden Fields'!$E$2:$F$3,2,FALSE)),\"\")","v":""}]
[null,null,null,null,null,null,null,null,{"$f":"IFERROR(C15/VLOOKUP(B15,'Hidden Fields'!$E$2:$F$3,2,FALSE),\"\")","v":""},{"$f":"IFERROR((G15-((C15*H15)/VLOOKUP(B15,'Hidden Fields'!$E$2:$F$3,2,FALSE)))/G15,\"\")","v":""},{"$f":"IFERROR(G15/((C15*H15)/VLOOKUP(B15,'Hidden Fields'!$E$2:$F$3,2,FALSE)),\"\")","v":""}]
{"$rows_left_out":400}
{"sheet":"Hidden Fields","index":4,"n_rows":19,"n_cols":12,"rows_kept":19,"cut":false,"hidden":true,"merged":[]}
["Wine Sizes","Wine numOZ","Beer Sizes","Beer numOZ","Spirit Sizes","Spirit numOZ",null,"Beer Category","Spirit Category","Wine Types","Beer Types","Spirit Types"]
["187ml",6.3,"12oz",12,"750ml",25.3,null,"Draft","Well","Sparkling","Lager","Bourbon"]
["375ml",12.6,"16oz",16,"1L",33.700000000000003,null,"Bottle","Call","White","Belgian","Brandy"]
["500ml",16.899999999999999,"20oz",20,null,null,null,"Can","Premium","Rose","Bitter","Gin"]
["750ml",25.3,"22oz",22,null,null,null,null,"Top Shelf","Red","Bock","Liqueur"]
["1.5L",50.6,"Mini keg (1.32g)",169,null,null,null,null,null,"Dessert","Brown Ale","Other"]
["3L",101.2,"Cornelius keg (5g)",640,null,null,null,null,null,"Port / Sherry","Cider","Rum"]
["5L",168.7,"1/6 barrel keg (5.16g)",660,null,null,null,null,null,"Other","German","Scotch"]
["6L",202.4,"1/4 barrel keg (7.75g)",984,null,null,null,null,null,null,"India Pale Ale","Tequila"]
["9L",303.60000000000002,"1/2 barrel keg (15.5g)",1980,null,null,null,null,null,null,"Lambic/Sour","Vodka"]
[null,null,null,null,null,null,null,null,null,null,"Pale Ale","Whiskey"]
[null,null,null,null,null,null,null,null,null,null,"Pilsner"]
[null,null,null,null,null,null,null,null,null,null,"Porter"]
[null,null,null,null,null,null,null,null,null,null,"Scottish Ale"]
[null,null,null,null,null,null,null,null,null,null,"Smoked/Barleywine"]
{"$rows_left_out":5}
{"sheet":"Summary","index":5,"n_rows":27,"n_cols":16,"rows_kept":27,"cut":false,"hidden":false,"merged":[[1,0,1,1],[1,7,1,8],[1,12,1,13]]}
[]
["Wine",null,null,null,null,null,null,"Beer",null,null,null,null,"Liquor"]
["Average Pour Cost ($/oz)",{"$f":"AVERAGE(Wines!H2:H407)","v":1.6351778656126481},null,null,null,null,null,"Average Pour Cost ($/oz)",{"$f":"AVERAGE(Beers!I2:I400)","v":0.14625277161862529},null,null,null,"Average Pour Cost ($/oz)",{"$f":"AVERAGE(Liquors!I2:I400)","v":1.4660079051383399}]
["Average Margin (Glass)",{"$f":"AVERAGE(Wines!I2:I407)","v":0.67990598290598292},null,null,null,null,null,"Average Margin",{"$f":"AVERAGE(Beers!J2:J400)","v":0.70824041811846672},null,null,null,"Average Margin",{"$f":"AVERAGE(Liquors!J2:J400)","v":0.77314097496706202}]
["Average Markup (Glass)",{"$f":"AVERAGE(Wines!J2:J408)","v":2.6998411713871024},null,null,null,null,null,"Average Markup",{"$f":"AVERAGE(Beers!K2:K400)","v":4.1512564102564102},null,null,null,"Average Markup",{"$f":"AVERAGE(Liquors!K2:K400)","v":4.9267325929161681}]
["Average Margin (Bottle)",{"$f":"AVERAGE(Wines!K2:K409)","v":0.5610272108843537}]
["Average Markup (Bottle)",{"$f":"AVERAGE(Wines!L2:L410)","v":2.4987306850762363}]
[]
[]
["Wine Type","Avg Pour cost ($/oz)","Avg Margin (Glass)","Avg Markup (Glass)","Avg Margin (Bottle)","Avg Markup (Bottle)",null,"Beer Type","Avg Pour Cost ($/oz)","Avg Margin","Avg Markup",null,"Liquor Type","Avg Pour Cost ($/oz)","Avg Margin","Avg Markup"]
["Sparkling",0.81225296442687744,0.68384615384615388,3.16301703163017,0.58061224489795915,2.384428223844282,null,"India Pale Ale",9.5454545454545459E-2,0.78181818181818186,4.583333333333333,null,"Rum",0.33596837944664032,0.88801054018445325,8.9294117647058826]
["White",1.6837944664031621,0.52666666666666673,2.1126760563380285,0.40833333333333333,1.6901408450704225,null,"Lager",6.25E-2,0.875,8,null,"Vodka",1.3735177865612649,0.72529644268774707,3.6402877697841727]
["Red",4.7628458498023711,{"$error":"#DIV/0!"},0,0.42619047619047618,1.7427385892116183,null,"Brown Ale",0.15853658536585366,0.6376306620209059,2.7596153846153846,null,"Bourbon",0.94466403162055324,0.76383399209486169,4.2343096234309625]
["Rose",0.43873517786561261,0.77800000000000002,4.5045045045045047,0.73571428571428565,3.7837837837837838,null,"Belgian",0.20738636363636365,0.62337662337662336,2.7066666666666666,null,"Whiskey",3.0909090909090908,0.7527272727272728,4.0441176470588234]
["Grand Total",1.9244071146245056,0.66283760683760684,2.4450493981181758,0.53771258503401353,2.4002728604775267,null,"Grand Total",0.14625277161862529,0.70824041811846672,4.1512564102564102,null,"Brandy",1.5849802371541502,0.73583662714097497,3.7855361596009978]
{"$rows_left_out":13}
{"sheet":"About","index":6,"n_rows":11,"n_cols":2,"rows_kept":11,"cut":false,"hidden":false,"merged":[[0,0,8,17],[10,1,12,16]]}
["Uncorkd provides software solutions to the hospitality industry to make it easier to manage the beverage program. This includes interactive, digital menus that can be handed to customers at the table with images, descriptions and more information, encouraging customers to order and spend more. Venues can update and manage their menus in real-time so that customers don't order something that is out of stock and removing the cost and hassle of constantly printing new menus.\n\nThe Uncorkd software also makes it easier and faster to perform beverage inventory. From any device you can quickly take inventory counts, track history and costs, set par values, organize by distributor and connect to your POS system for real-time inventory depletion. Uncorkd provides detailed inventory, sales and ordering reports along with menu analytics to better analyze your beverage program. With Uncorkd's extensive beverage database with hundreds of thousands of wines, beers and spirits, it is easy to add new drinks to your menu in seconds and better understand your inventory and sales data without the work of manually categorizing everything yourself."]
[]
[]
[]
[]
[]
[]
[]
[]
[]
[null,"Click here to visit the Uncorkd website to learn more"]